Target
Sodium-dependent serotonin transporter
Ligand
BDBM50014407
Substrate
Meas. Tech.
ChEMBL_201801 (CHEMBL806136)
Ki
31±n/a nM
Citation
 Cappelli, AAnzini, MVomero, SMennuni, LMakovec, FDoucet, EHamon, MBruni, GRomeo, MRMenziani, MCDe Benedetti, PGLanger, T Novel potent and selective central 5-HT3 receptor ligands provided with different intrinsic efficacy. 1. Mapping the central 5-HT3 receptor binding site by arylpiperazine derivatives. J Med Chem 41:728-41 (1998)  
Target
Name:
Sodium-dependent serotonin transporter
Synonyms:
5-HT Transporter 5HT transporter Anandamid membrane transporter, AMT Monoamine transporters; Norepinephrine & serotonin Slc6a4 Sodium-dependent serotonin transporter (SERT) | imipramine receptor
Type:
Multi-pass membrane protein
Mol. Mass.:
70168.43
Organism:
Rattus norvegicus (rat)
Description:
P31652
Residue:
630
  
Inhibitor
Name:
BDBM50014407
Synonyms:
2-(piperazin-1-yl)quinoline 2-Piperazin-1-yl-quinoline (Quipazine) CHEMBL18772 | QUIPAZINE
Type:
Small organic molecule
Emp. Form.:
C13H15N3
Mol. Mass.:
213.2783
SMILES:
C1CN(CCN1)c1ccc2ccccc2n1
: