Target
5-hydroxytryptamine receptor 2C
Ligand
BDBM50063263
Substrate
Meas. Tech.
ChEMBL_2811 (CHEMBL617841)
Ki
4400±n/a nM
Citation
 Cappelli, AAnzini, MVomero, SMennuni, LMakovec, FDoucet, EHamon, MBruni, GRomeo, MRMenziani, MCDe Benedetti, PGLanger, T Novel potent and selective central 5-HT3 receptor ligands provided with different intrinsic efficacy. 1. Mapping the central 5-HT3 receptor binding site by arylpiperazine derivatives. J Med Chem 41:728-41 (1998)  
Target
Name:
5-hydroxytryptamine receptor 2C
Synonyms:
5-HT2C 5-hydroxytryptamine receptor 2C (5HT2c) 5ht1c Htr2c Serotonin receptor 2a and 2c (5HT2A and 5HT2C)
Type:
Enzyme
Mol. Mass.:
51935.10
Organism:
Rattus norvegicus (Rat)
Description:
P08909
Residue:
460
  
Inhibitor
Name:
BDBM50063263
Synonyms:
6-(4-Methyl-piperazin-1-yl)-7,8,9,10-tetrahydro-phenanthridine | CHEMBL43355
Type:
Small organic molecule
Emp. Form.:
C18H23N3
Mol. Mass.:
281.3953
SMILES:
CN1CCN(CC1)c1nc2ccccc2c2CCCCc12
: