Target
5-hydroxytryptamine receptor 1B
Ligand
BDBM50014407
Substrate
Meas. Tech.
ChEMBL_1787 (CHEMBL616761)
Ki
310±n/a nM
Citation
 Cappelli, AAnzini, MVomero, SMennuni, LMakovec, FDoucet, EHamon, MBruni, GRomeo, MRMenziani, MCDe Benedetti, PGLanger, T Novel potent and selective central 5-HT3 receptor ligands provided with different intrinsic efficacy. 1. Mapping the central 5-HT3 receptor binding site by arylpiperazine derivatives. J Med Chem 41:728-41 (1998)  
Target
Name:
5-hydroxytryptamine receptor 1B
Synonyms:
5-HT-1B 5-hydroxytryptamine receptor 1B (5HT1B) 5ht1b Serotonin 1 (5-HT1) receptor Serotonin receptor 1B
Type:
Protein
Mol. Mass.:
43173.33
Organism:
Rattus norvegicus (Rat)
Description:
P28564
Residue:
386
  
Inhibitor
Name:
BDBM50014407
Synonyms:
2-(piperazin-1-yl)quinoline 2-Piperazin-1-yl-quinoline (Quipazine) CHEMBL18772 | QUIPAZINE
Type:
Small organic molecule
Emp. Form.:
C13H15N3
Mol. Mass.:
213.2783
SMILES:
C1CN(CCN1)c1ccc2ccccc2n1
: