Target
5-hydroxytryptamine receptor 1A
Ligand
BDBM50063263
Substrate
Meas. Tech.
ChEMBL_1304 (CHEMBL616681)
Ki
2800±n/a nM
Citation
 Cappelli, AAnzini, MVomero, SMennuni, LMakovec, FDoucet, EHamon, MBruni, GRomeo, MRMenziani, MCDe Benedetti, PGLanger, T Novel potent and selective central 5-HT3 receptor ligands provided with different intrinsic efficacy. 1. Mapping the central 5-HT3 receptor binding site by arylpiperazine derivatives. J Med Chem 41:728-41 (1998)  
Target
Name:
5-hydroxytryptamine receptor 1A
Synonyms:
5-HT-1A 5-HT1A 5-hydroxytryptamine receptor 1A (5HT1A) 5ht1a Htr1a Serotonin 1a (5-HT1a) receptor/Adrenergic receptor alpha-1 | Serotonin receptor 1A
Type:
G Protein-Coupled Receptor (GPCR)
Mol. Mass.:
46445.29
Organism:
Rattus norvegicus (rat)
Description:
Binding assays were performed using rat hippocampal membranes.
Residue:
422
  
Inhibitor
Name:
BDBM50063263
Synonyms:
6-(4-Methyl-piperazin-1-yl)-7,8,9,10-tetrahydro-phenanthridine | CHEMBL43355
Type:
Small organic molecule
Emp. Form.:
C18H23N3
Mol. Mass.:
281.3953
SMILES:
CN1CCN(CC1)c1nc2ccccc2c2CCCCc12
: