Target
Endothelin-converting enzyme 1
Ligand
BDBM50064114
Substrate
Meas. Tech.
ChEMBL_64360 (CHEMBL679847)
IC50
13±n/a nM
Citation
 Wallace, EMMoliterni, JAMoskal, MANeubert, ADMarcopulos, NStamford, LBTrapani, AJSavage, PChou, MJeng, AY Design and synthesis of potent, selective inhibitors of endothelin-converting enzyme. J Med Chem 41:1513-23 (1998)  
Target
Name:
Endothelin-converting enzyme 1
Synonyms:
ECE-1 ECE1_HUMAN Endothelin-converting enzyme 1 (ECE1)
Type:
Enzyme
Mol. Mass.:
87155.11
Organism:
Homo sapiens (Human)
Description:
P42892
Residue:
770
  
Inhibitor
Name:
BDBM50064114
Synonyms:
(S)-3-Biphenyl-4-yl-2-[(S)-5-(2-fluoro-phenyl)-2-(phosphonomethyl-amino)-pent-4-ynoylamino]-propionic acid | CHEMBL37052
Type:
Small organic molecule
Emp. Form.:
C27H26FN2O6P
Mol. Mass.:
524.4773
SMILES:
OC(=O)[C@H](Cc1ccc(cc1)-c1ccccc1)NC(=O)[C@H](CC#Cc1ccccc1F)NCP(O)(O)=O
: