Target
Prothrombin
Ligand
BDBM50082581
Substrate
Meas. Tech.
ChEMBL_210598 (CHEMBL816565)
Ki
43±n/a nM
Citation
 Brundish, DBull, ADonovan, VFullerton, JDGarman, SMHayler, JFJanus, DKane, PDMcDonnell, MSmith, GPWakeford, RWalker, CVHowarth, GHoyle, WAllen, MCAmbler, JButler, KTalbot, MD Design and synthesis of thrombin inhibitors: analogues of MD-805 with reduced stereogenicity and improved potency. J Med Chem 42:4584-603 (1999)  
Target
Name:
Prothrombin
Synonyms:
Activation peptide fragment 1 Coagulation factor II Prothrombin Thrombin Thrombin light chain
Type:
Enzyme
Mol. Mass.:
70502.73
Organism:
Bos taurus (Bovine)
Description:
P00735
Residue:
625
  
Inhibitor
Name:
BDBM50082581
Synonyms:
CHEMBL143203 | N-(2-{1-[2-(3,3-Dimethyl-1,2,3,4-tetrahydro-quinoline-8-sulfonylamino)-5-guanidino-pentanoyl]-piperidin-4-yl}-ethyl)-acetamide
Type:
Small organic molecule
Emp. Form.:
C26H43N7O4S
Mol. Mass.:
549.729
SMILES:
CC(=O)NCCC1CCN(CC1)C(=O)C(CCCNC(N)=N)NS(=O)(=O)c1cccc2CC(C)(C)CNc12
: