Target
Prothrombin
Ligand
BDBM50082590
Substrate
Meas. Tech.
ChEMBL_210598 (CHEMBL816565)
Ki
1200±n/a nM
Citation
 Brundish, DBull, ADonovan, VFullerton, JDGarman, SMHayler, JFJanus, DKane, PDMcDonnell, MSmith, GPWakeford, RWalker, CVHowarth, GHoyle, WAllen, MCAmbler, JButler, KTalbot, MD Design and synthesis of thrombin inhibitors: analogues of MD-805 with reduced stereogenicity and improved potency. J Med Chem 42:4584-603 (1999)  
Target
Name:
Prothrombin
Synonyms:
Activation peptide fragment 1 Coagulation factor II Prothrombin Thrombin Thrombin light chain
Type:
Enzyme
Mol. Mass.:
70502.73
Organism:
Bos taurus (Bovine)
Description:
P00735
Residue:
625
  
Inhibitor
Name:
BDBM50082590
Synonyms:
(2S,4S)-1-{5-Guanidino-2-[3-(1-methyl-1-phenyl-ethyl)-benzenesulfonylamino]-pentanoyl}-4-methyl-piperidine-2-carboxylic acid | CHEMBL140066
Type:
Small organic molecule
Emp. Form.:
C28H39N5O5S
Mol. Mass.:
557.705
SMILES:
C[C@H]1CCN([C@@H](C1)C(O)=O)C(=O)C(CCCNC(N)=N)NS(=O)(=O)c1cccc(c1)C(C)(C)c1ccccc1
: