Target
Anionic trypsin
Ligand
BDBM50082580
Substrate
Meas. Tech.
ChEMBL_212897 (CHEMBL824725)
Ki
7100±n/a nM
Citation
 Brundish, DBull, ADonovan, VFullerton, JDGarman, SMHayler, JFJanus, DKane, PDMcDonnell, MSmith, GPWakeford, RWalker, CVHowarth, GHoyle, WAllen, MCAmbler, JButler, KTalbot, MD Design and synthesis of thrombin inhibitors: analogues of MD-805 with reduced stereogenicity and improved potency. J Med Chem 42:4584-603 (1999)  
Target
Name:
Anionic trypsin
Synonyms:
Anionic trypsin Trypsin II
Type:
PROTEIN
Mol. Mass.:
26281.39
Organism:
Bos taurus
Description:
ChEMBL_212177
Residue:
247
  
Inhibitor
Name:
BDBM50082580
Synonyms:
3,3-Dimethyl-1,2,3,4-tetrahydro-quinoline-8-sulfonic acid {4-guanidino-1-[4-(2-hydroxy-ethyl)-piperidine-1-carbonyl]-butyl}-amide | CHEMBL448420
Type:
Small organic molecule
Emp. Form.:
C24H40N6O4S
Mol. Mass.:
508.677
SMILES:
CC1(C)CNc2c(C1)cccc2S(=O)(=O)NC(CCCNC(N)=N)C(=O)N1CCC(CCO)CC1
: