Target
Prothrombin
Ligand
BDBM50082596
Substrate
Meas. Tech.
ChEMBL_210598 (CHEMBL816565)
Ki
890±n/a nM
Citation
 Brundish, DBull, ADonovan, VFullerton, JDGarman, SMHayler, JFJanus, DKane, PDMcDonnell, MSmith, GPWakeford, RWalker, CVHowarth, GHoyle, WAllen, MCAmbler, JButler, KTalbot, MD Design and synthesis of thrombin inhibitors: analogues of MD-805 with reduced stereogenicity and improved potency. J Med Chem 42:4584-603 (1999)  
Target
Name:
Prothrombin
Synonyms:
Activation peptide fragment 1 Coagulation factor II Prothrombin Thrombin Thrombin light chain
Type:
Enzyme
Mol. Mass.:
70502.73
Organism:
Bos taurus (Bovine)
Description:
P00735
Residue:
625
  
Inhibitor
Name:
BDBM50082596
Synonyms:
3-Methyl-1,2,3,4-tetrahydro-quinoline-8-sulfonic acid [4-guanidino-1-(3-hydroxymethyl-3,4-dihydro-1H-isoquinoline-2-carbonyl)-butyl]-amide | CHEMBL344937
Type:
Small organic molecule
Emp. Form.:
C26H36N6O4S
Mol. Mass.:
528.667
SMILES:
CC1CNc2c(C1)cccc2S(=O)(=O)NC(CCCNC(N)=N)C(=O)N1Cc2ccccc2CC1CO
: