Target
Prothrombin
Ligand
BDBM50082597
Substrate
Meas. Tech.
ChEMBL_210598 (CHEMBL816565)
Ki
56±n/a nM
Citation
 Brundish, DBull, ADonovan, VFullerton, JDGarman, SMHayler, JFJanus, DKane, PDMcDonnell, MSmith, GPWakeford, RWalker, CVHowarth, GHoyle, WAllen, MCAmbler, JButler, KTalbot, MD Design and synthesis of thrombin inhibitors: analogues of MD-805 with reduced stereogenicity and improved potency. J Med Chem 42:4584-603 (1999)  
Target
Name:
Prothrombin
Synonyms:
Activation peptide fragment 1 Coagulation factor II Prothrombin Thrombin Thrombin light chain
Type:
Enzyme
Mol. Mass.:
70502.73
Organism:
Bos taurus (Bovine)
Description:
P00735
Residue:
625
  
Inhibitor
Name:
BDBM50082597
Synonyms:
2,2-Dimethyl-propionic acid 2-{1-[2-(6-chloro-3,3-dimethyl-1,2,3,4-tetrahydro-quinoline-8-sulfonylamino)-5-guanidino-pentanoyl]-piperidin-4-yl}-ethyl ester | CHEMBL346638
Type:
Small organic molecule
Emp. Form.:
C29H47ClN6O5S
Mol. Mass.:
627.239
SMILES:
CC(C)(C)C(=O)OCCC1CCN(CC1)C(=O)C(CCCNC(N)=N)NS(=O)(=O)c1cc(Cl)cc2CC(C)(C)CNc12
: