Target
Prothrombin
Ligand
BDBM50082589
Substrate
Meas. Tech.
ChEMBL_210598 (CHEMBL816565)
Ki
19±n/a nM
Citation
 Brundish, DBull, ADonovan, VFullerton, JDGarman, SMHayler, JFJanus, DKane, PDMcDonnell, MSmith, GPWakeford, RWalker, CVHowarth, GHoyle, WAllen, MCAmbler, JButler, KTalbot, MD Design and synthesis of thrombin inhibitors: analogues of MD-805 with reduced stereogenicity and improved potency. J Med Chem 42:4584-603 (1999)  
Target
Name:
Prothrombin
Synonyms:
Activation peptide fragment 1 Coagulation factor II Prothrombin Thrombin Thrombin light chain
Type:
Enzyme
Mol. Mass.:
70502.73
Organism:
Bos taurus (Bovine)
Description:
P00735
Residue:
625
  
Inhibitor
Name:
BDBM50082589
Synonyms:
3-Methyl-1,2,3,4-tetrahydro-quinoline-8-sulfonic acid {1-[4-(2-chloro-ethyl)-piperidine-1-carbonyl]-4-guanidino-butyl}-amide | CHEMBL342083
Type:
Small organic molecule
Emp. Form.:
C23H37ClN6O3S
Mol. Mass.:
513.096
SMILES:
CC1CNc2c(C1)cccc2S(=O)(=O)NC(CCCNC(N)=N)C(=O)N1CCC(CCCl)CC1
: