Target
Prothrombin
Ligand
BDBM50082600
Substrate
Meas. Tech.
ChEMBL_210598 (CHEMBL816565)
Ki
490±n/a nM
Citation
 Brundish, DBull, ADonovan, VFullerton, JDGarman, SMHayler, JFJanus, DKane, PDMcDonnell, MSmith, GPWakeford, RWalker, CVHowarth, GHoyle, WAllen, MCAmbler, JButler, KTalbot, MD Design and synthesis of thrombin inhibitors: analogues of MD-805 with reduced stereogenicity and improved potency. J Med Chem 42:4584-603 (1999)  
Target
Name:
Prothrombin
Synonyms:
Activation peptide fragment 1 Coagulation factor II Prothrombin Thrombin Thrombin light chain
Type:
Enzyme
Mol. Mass.:
70502.73
Organism:
Bos taurus (Bovine)
Description:
P00735
Residue:
625
  
Inhibitor
Name:
BDBM50082600
Synonyms:
1,2,3,4-Tetrahydro-quinoline-8-sulfonic acid {4-guanidino-1-[4-(2-hydroxy-ethyl)-piperidine-1-carbonyl]-butyl}-amide | CHEMBL142760
Type:
Small organic molecule
Emp. Form.:
C22H36N6O4S
Mol. Mass.:
480.624
SMILES:
NC(=N)NCCCC(NS(=O)(=O)c1cccc2CCCNc12)C(=O)N1CCC(CCO)CC1
: