Target
Prothrombin
Ligand
BDBM50082608
Substrate
Meas. Tech.
ChEMBL_210598 (CHEMBL816565)
Ki
34±n/a nM
Citation
 Brundish, DBull, ADonovan, VFullerton, JDGarman, SMHayler, JFJanus, DKane, PDMcDonnell, MSmith, GPWakeford, RWalker, CVHowarth, GHoyle, WAllen, MCAmbler, JButler, KTalbot, MD Design and synthesis of thrombin inhibitors: analogues of MD-805 with reduced stereogenicity and improved potency. J Med Chem 42:4584-603 (1999)  
Target
Name:
Prothrombin
Synonyms:
Activation peptide fragment 1 Coagulation factor II Prothrombin Thrombin Thrombin light chain
Type:
Enzyme
Mol. Mass.:
70502.73
Organism:
Bos taurus (Bovine)
Description:
P00735
Residue:
625
  
Inhibitor
Name:
BDBM50082608
Synonyms:
CHEMBL139718 | Succinic acid mono-(2-{1-[5-guanidino-2-(3-methyl-1,2,3,4-tetrahydro-quinoline-8-sulfonylamino)-pentanoyl]-piperidin-4-yl}-ethyl) ester
Type:
Small organic molecule
Emp. Form.:
C27H42N6O7S
Mol. Mass.:
594.723
SMILES:
CC1CNc2c(C1)cccc2S(=O)(=O)NC(CCCNC(N)=N)C(=O)N1CCC(CCOC(=O)CCC(O)=O)CC1
: