Target
Prothrombin
Ligand
BDBM50082612
Substrate
Meas. Tech.
ChEMBL_210598 (CHEMBL816565)
Ki
27±n/a nM
Citation
 Brundish, DBull, ADonovan, VFullerton, JDGarman, SMHayler, JFJanus, DKane, PDMcDonnell, MSmith, GPWakeford, RWalker, CVHowarth, GHoyle, WAllen, MCAmbler, JButler, KTalbot, MD Design and synthesis of thrombin inhibitors: analogues of MD-805 with reduced stereogenicity and improved potency. J Med Chem 42:4584-603 (1999)  
Target
Name:
Prothrombin
Synonyms:
Activation peptide fragment 1 Coagulation factor II Prothrombin Thrombin Thrombin light chain
Type:
Enzyme
Mol. Mass.:
70502.73
Organism:
Bos taurus (Bovine)
Description:
P00735
Residue:
625
  
Inhibitor
Name:
BDBM50082612
Synonyms:
3-Methyl-1,2,3,4-tetrahydro-quinoline-8-sulfonic acid [1-(4-ethyl-piperidine-1-carbonyl)-4-guanidino-butyl]-amide | CHEMBL336929
Type:
Small organic molecule
Emp. Form.:
C23H38N6O3S
Mol. Mass.:
478.651
SMILES:
CCC1CCN(CC1)C(=O)C(CCCNC(N)=N)NS(=O)(=O)c1cccc2CC(C)CNc12
: