Target
Substance-K receptor
Ligand
BDBM50074791
Substrate
Meas. Tech.
ChEMBL_209039 (CHEMBL815485)
Ki
144±n/a nM
Citation
 Giardina, GARaveglia, LFGrugni, MSarau, HMFarina, CMedhurst, ADGraziani, DSchmidt, DBRigolio, RLuttmann, MCavagnera, SFoley, JJVecchietti, VHay, DW Discovery of a novel class of selective non-peptide antagonists for the human neurokinin-3 receptor. 2. Identification of (S)-N-(1-phenylpropyl)-3-hydroxy-2-phenylquinoline-4-carboxamide (SB 223412). J Med Chem 42:1053-65 (1999)  
Target
Name:
Substance-K receptor
Synonyms:
NK-2 receptor NK2R NKNAR Neurokinin A receptor Neurokinin-2 (NK-2) SKR TACR2 Tachykinin receptor 2 (NK2) | hnk-3
Type:
Protein
Mol. Mass.:
44455.78
Organism:
Homo sapiens (Human)
Description:
P21452
Residue:
398
  
Inhibitor
Name:
BDBM50074791
Synonyms:
3-Hydroxy-2-phenyl-quinoline-4-carboxylic acid ((R)-1-phenyl-propyl)-amide | CHEMBL430118
Type:
Small organic molecule
Emp. Form.:
C25H22N2O2
Mol. Mass.:
382.4544
SMILES:
CC[C@@H](NC(=O)c1c(O)c(nc2ccccc12)-c1ccccc1)c1ccccc1
: