Target
D(2) dopamine receptor
Ligand
BDBM50002238
Substrate
Meas. Tech.
ChEMBL_61740 (CHEMBL676047)
IC50
>1000±n/a nM
Citation
 Nakazato, AOhta, KSekiguchi, YOkuyama, SChaki, SKawashima, YHatayama, K Design, synthesis, structure-activity relationships, and biological characterization of novel arylalkoxyphenylalkylamine sigma ligands as potential antipsychotic drugs. J Med Chem 42:1076-87 (1999)  
Target
Name:
D(2) dopamine receptor
Synonyms:
DOPAMINE D2 DOPAMINE D2 Short Dopamine D2 receptor Drd2
Type:
G Protein-Coupled Receptor (GPCR)
Mol. Mass.:
50931.60
Organism:
Rattus norvegicus (rat)
Description:
P61169
Residue:
444
  
Inhibitor
Name:
BDBM50002238
Synonyms:
(R)1-(4-Fluoro-phenyl)-4-[4-(5-fluoro-pyrimidin-2-yl)-piperazin-1-yl]-butan-1-ol 1-(4-Fluoro-phenyl)-1-[4-(5-fluoro-pyrimidin-2-yl)-piperazin-1-yl]-butan-1-ol(BMY-14802) 1-(4-Fluoro-phenyl)-4-[4-(5-fluoro-pyrimidin-2-yl)-piperazin-1-yl]-butan-1-ol 1-(4-fluorophenyl)-4-(4-(5-fluoropyrimidin-2-yl)piperazin-1-yl)butan-1-ol 4-{4-[5-Fluoro-2-(4-fluoro-phenyl)-2H-pyrimidin-1-yl]-piperazin-1-yl}-butan-1-ol(BMY 14802) CHEMBL60859
Type:
Small organic molecule
Emp. Form.:
C18H22F2N4O
Mol. Mass.:
348.3903
SMILES:
OC(CCCN1CCN(CC1)c1ncc(F)cn1)c1ccc(F)cc1
: