Target
5-hydroxytryptamine receptor 2A
Ligand
BDBM50076402
Substrate
Meas. Tech.
ChEMBL_2629 (CHEMBL621541)
Ki
3100±n/a nM
Citation
 Cappelli, AAnzini, MVomero, SCanullo, LMennuni, LMakovec, FDoucet, EHamon, MMenziani, MCDe Benedetti, PGBruni, GRomeo, MRGiorgi, GDonati, A Novel potent and selective central 5-HT3 receptor ligands provided with different intrinsic efficacy. 2. Molecular basis of the intrinsic efficacy of arylpiperazine derivatives at the central 5-HT3 receptors. J Med Chem 42:1556-75 (1999)  
Target
Name:
5-hydroxytryptamine receptor 2A
Synonyms:
5-HT-2A 5-HT2A 5-hydroxytryptamine receptor 2A (5HT2A) Htr2 Serotonin Receptor 2A
Type:
G Protein-Coupled Receptor (GPCR)
Mol. Mass.:
52852.05
Organism:
Rattus norvegicus (rat)
Description:
Rat cortex membranes 5-HT2A receptors.
Residue:
471
  
Inhibitor
Name:
BDBM50076402
Synonyms:
6-(4-Methyl-piperazin-1-yl)-4,5-dihydro-3-thia-7-aza-cyclopenta[c]phenanthrene | CHEMBL288069
Type:
Small organic molecule
Emp. Form.:
C20H21N3S
Mol. Mass.:
335.466
SMILES:
CN1CCN(CC1)c1nc2ccccc2c2-c3ccsc3CCc12
: