Target
5-hydroxytryptamine receptor 2C
Ligand
BDBM50076402
Substrate
Meas. Tech.
ChEMBL_2825 (CHEMBL621511)
Ki
420000±n/a nM
Citation
 Cappelli, AAnzini, MVomero, SCanullo, LMennuni, LMakovec, FDoucet, EHamon, MMenziani, MCDe Benedetti, PGBruni, GRomeo, MRGiorgi, GDonati, A Novel potent and selective central 5-HT3 receptor ligands provided with different intrinsic efficacy. 2. Molecular basis of the intrinsic efficacy of arylpiperazine derivatives at the central 5-HT3 receptors. J Med Chem 42:1556-75 (1999)  
Target
Name:
5-hydroxytryptamine receptor 2C
Synonyms:
5-HT2C 5-hydroxytryptamine receptor 2C (5HT2c) 5ht1c Htr2c Serotonin receptor 2a and 2c (5HT2A and 5HT2C)
Type:
Enzyme
Mol. Mass.:
51935.10
Organism:
Rattus norvegicus (Rat)
Description:
P08909
Residue:
460
  
Inhibitor
Name:
BDBM50076402
Synonyms:
6-(4-Methyl-piperazin-1-yl)-4,5-dihydro-3-thia-7-aza-cyclopenta[c]phenanthrene | CHEMBL288069
Type:
Small organic molecule
Emp. Form.:
C20H21N3S
Mol. Mass.:
335.466
SMILES:
CN1CCN(CC1)c1nc2ccccc2c2-c3ccsc3CCc12
: