Target
Histamine N-methyltransferase
Ligand
BDBM27213
Substrate
Meas. Tech.
ChEMBL_87237 (CHEMBL696457)
IC50
9000±n/a nM
Citation
 Stark, HSadek, BKrause, MHüls, ALigneau, XGanellin, CRArrang, JMSchwartz, JCSchunack, W Novel histamine H(3)-receptor antagonists with carbonyl-substituted 4-(3-(phenoxy)propyl)-1H-imidazole structures like ciproxifan and related compounds. J Med Chem 43:3987-94 (2000)  
Target
Name:
Histamine N-methyltransferase
Synonyms:
HNMT_RAT | Hnmt
Type:
PROTEIN
Mol. Mass.:
33931.03
Organism:
Rattus norvegicus
Description:
ChEMBL_87236
Residue:
295
  
Inhibitor
Name:
BDBM27213
Synonyms:
4-[3-(4-cyclopropanecarbonylphenoxy)propyl]-1H-imidazole CHEMBL1795025 | Ciproxifan
Type:
Small organic molecule
Emp. Form.:
C16H18N2O2
Mol. Mass.:
270.3263
SMILES:
O=C(C1CC1)c1ccc(OCCCc2cnc[nH]2)cc1
: