Target
3-oxo-5-alpha-steroid 4-dehydrogenase 1
Ligand
BDBM50093592
Substrate
Meas. Tech.
ChEMBL_205058 (CHEMBL810252)
IC50
900±n/a nM
Citation
 Hartmann, RWHector, MHaidar, SEhmer, PBReichert, WJose, J Synthesis and evaluation of novel steroidal oxime inhibitors of P450 17 (17 alpha-hydroxylase/C17-20-lyase) and 5 alpha-reductase types 1 and 2. J Med Chem 43:4266-77 (2000)  
Target
Name:
3-oxo-5-alpha-steroid 4-dehydrogenase 1
Synonyms:
3-oxo-5-alpha-steroid 4-dehydrogenase 1 S5A1_HUMAN SR type 1 Steroid 5-alpha-reductase | Steroid 5-alpha-reductase 1
Type:
Enzyme
Mol. Mass.:
29472.80
Organism:
Homo sapiens (Human)
Description:
P18405
Residue:
259
  
Inhibitor
Name:
BDBM50093592
Synonyms:
17-(2-Hydroxyimino-propyl)-10,13-dimethyl-1,2,6,7,8,9,10,11,12,13,14,15,16,17-tetradecahydro-cyclopenta[a]phenanthren-3-one | CHEMBL137040
Type:
Small organic molecule
Emp. Form.:
C22H33NO2
Mol. Mass.:
343.5029
SMILES:
CC(CC1CCC2C3CCC4=CC(=O)CCC4(C)C3CCC12C)N=O
: