Target
3-oxo-5-alpha-steroid 4-dehydrogenase 2
Ligand
BDBM50093598
Substrate
Meas. Tech.
ChEMBL_204910 (CHEMBL809545)
IC50
430±n/a nM
Citation
 Hartmann, RWHector, MHaidar, SEhmer, PBReichert, WJose, J Synthesis and evaluation of novel steroidal oxime inhibitors of P450 17 (17 alpha-hydroxylase/C17-20-lyase) and 5 alpha-reductase types 1 and 2. J Med Chem 43:4266-77 (2000)  
Target
Name:
3-oxo-5-alpha-steroid 4-dehydrogenase 2
Synonyms:
3-oxo-5-alpha-steroid 4-dehydrogenase 2 5α-Reductase 2 (5α-R2) SR type 2 Steroid 5-alpha-reductase Type II 5-alpha reductase
Type:
Enzyme
Mol. Mass.:
28406.59
Organism:
Homo sapiens (Human)
Description:
P31213
Residue:
254
  
Inhibitor
Name:
BDBM50093598
Synonyms:
17-(2-Hydroxyimino-propyl)-10,13-dimethyl-1,7,8,9,10,11,12,13,14,15,16,17-dodecahydro-2H-cyclopenta[a]phenanthrene-3,6-dione | CHEMBL136097
Type:
Small organic molecule
Emp. Form.:
C22H31NO3
Mol. Mass.:
357.4864
SMILES:
CC(CC1CCC2C3CC(=O)C4=CC(=O)CCC4(C)C3CCC12C)N=O
: