Target
Steroid 17-alpha-hydroxylase/17,20 lyase
Ligand
BDBM50093602
Substrate
Meas. Tech.
ChEMBL_50358 (CHEMBL662518)
IC50
40±n/a nM
Citation
 Hartmann, RWHector, MHaidar, SEhmer, PBReichert, WJose, J Synthesis and evaluation of novel steroidal oxime inhibitors of P450 17 (17 alpha-hydroxylase/C17-20-lyase) and 5 alpha-reductase types 1 and 2. J Med Chem 43:4266-77 (2000)  
Target
Name:
Steroid 17-alpha-hydroxylase/17,20 lyase
Synonyms:
CP17A_HUMAN CYP17A1 Cytochrome P450 17A1 Cytochrome P450 C17 (CYP17) Cytochrome P450-C17 P450-C17 Steroid 17-alpha-Monooxygenase (CYP17) Steroid 17-alpha-monooxygenase | cytochrome P450 monooxygenase 17 alpha hydroxylase/17,20-lyase (CYP17)
Type:
Enzyme
Mol. Mass.:
57382.42
Organism:
Homo sapiens (Human)
Description:
E.coli expressing human CYP17
Residue:
508
  
Inhibitor
Name:
BDBM50093602
Synonyms:
17-(1H-Imidazol-4-yl)-10,13-dimethyl-2,3,4,7,8,9,10,11,12,13,14,15-dodecahydro-1H-cyclopenta[a]phenanthren-3-ol | CHEMBL134644
Type:
Small organic molecule
Emp. Form.:
C22H30N2O
Mol. Mass.:
338.4864
SMILES:
CC12CCC3C(CC=C4CC(O)CCC34C)C1CC=C2c1cnc[nH]1
: