Target
Neuronal acetylcholine receptor subunit alpha-7
Ligand
BDBM50107857
Substrate
Meas. Tech.
ChEMBL_144184 (CHEMBL749305)
Ki
>10000±n/a nM
Citation
 Efange, SMTu, Zvon Hohenberg, KFrancesconi, LHowell, RCRampersad, MVTodaro, LJPapke, RLKung, MP 2-(2-Piperidyl)- and 2-(2-pyrrolidyl)chromans as nicotine agonists: synthesis and preliminary pharmacological characterization. J Med Chem 44:4704-15 (2001)  
Target
Name:
Neuronal acetylcholine receptor subunit alpha-7
Synonyms:
ACHA7_RAT Cholinergic, Nicotinic Alpha7 Chrna7 Neuronal acetylcholine receptor (alpha7 nAChR) Neuronal acetylcholine receptor subunit alpha-7 Neuronal acetylcholine receptor subunit alpha-7 (nAChR)
Type:
Enzyme
Mol. Mass.:
56502.44
Organism:
Rattus norvegicus (Rat)
Description:
Q05941
Residue:
502
  
Inhibitor
Name:
BDBM50107857
Synonyms:
(+-)-2-Chroman-2-yl-1-methyl-piperidine | CHEMBL357267
Type:
Small organic molecule
Emp. Form.:
C15H21NO
Mol. Mass.:
231.3333
SMILES:
CN1CCCC[C@H]1[C@@H]1CCc2ccccc2O1
: