Target
Neuronal acetylcholine receptor subunit alpha-7
Ligand
BDBM50107856
Substrate
Meas. Tech.
ChEMBL_144028 (CHEMBL750443)
EC50
197±n/a nM
Citation
 Efange, SMTu, Zvon Hohenberg, KFrancesconi, LHowell, RCRampersad, MVTodaro, LJPapke, RLKung, MP 2-(2-Piperidyl)- and 2-(2-pyrrolidyl)chromans as nicotine agonists: synthesis and preliminary pharmacological characterization. J Med Chem 44:4704-15 (2001)  
Target
Name:
Neuronal acetylcholine receptor subunit alpha-7
Synonyms:
ACHA7_HUMAN Cholinergic, Nicotinic Alpha7 Neuronal acetylcholine receptor protein alpha-7 subunit Nicotinic acetylcholine receptor alpha-7 (alpha7 nAChR)
Type:
Mol. Mass.:
56448.33
Organism:
Homo sapiens (Human)
Description:
CHRNA7 (NACHRA7)
Residue:
502
  
Inhibitor
Name:
BDBM50107856
Synonyms:
(+-)-2-(1-Methyl-pyrrolidin-2-yl)-chroman-7-ol CHEMBL141379
Type:
Small organic molecule
Emp. Form.:
C14H19NO2
Mol. Mass.:
233.3062
SMILES:
CN1CCC[C@H]1[C@H]1CCc2ccc(O)cc2O1
: