Target
Neutrophil elastase
Ligand
BDBM50098812
Substrate
Meas. Tech.
ChEMBL_63965 (CHEMBL677434)
Ki
43.8±n/a nM
Citation
 Ohmoto, KYamamoto, TOkuma, MHoriuchi, TImanishi, HOdagaki, YKawabata, KSekioka, THirota, YMatsuoka, SNakai, HToda, MCheronis, JCSpruce, LWGyorkos, AWieczorek, M Development of orally active nonpeptidic inhibitors of human neutrophil elastase. J Med Chem 44:1268-85 (2001)  
Target
Name:
Neutrophil elastase
Synonyms:
Bone marrow serine protease Coagulation factor X ELANE Elastase HLE Leukocyte elastase Medullasin Neutrophil elastase (HNE) PMN elastase Trypsin
Type:
Enzyme
Mol. Mass.:
28532.38
Organism:
Homo sapiens (Human)
Description:
P08246
Residue:
267
  
Inhibitor
Name:
BDBM50098812
Synonyms:
2-[2-(4-Fluoro-phenyl)-6-oxo-6H-pyrimidin-1-yl]-N-{2-methyl-1-[5-(1-methyl-cyclopropyl)-[1,3,4]oxadiazole-2-carbonyl]-propyl}-acetamide | CHEMBL23080
Type:
Small organic molecule
Emp. Form.:
C23H24FN5O4
Mol. Mass.:
453.4662
SMILES:
CC(C)[C@H](NC(=O)Cn1c(nccc1=O)-c1ccc(F)cc1)C(=O)c1nnc(o1)C1(C)CC1
: