Target
Neutrophil elastase
Ligand
BDBM50098832
Substrate
Meas. Tech.
ChEMBL_63965 (CHEMBL677434)
Ki
23.5±n/a nM
Citation
 Ohmoto, KYamamoto, TOkuma, MHoriuchi, TImanishi, HOdagaki, YKawabata, KSekioka, THirota, YMatsuoka, SNakai, HToda, MCheronis, JCSpruce, LWGyorkos, AWieczorek, M Development of orally active nonpeptidic inhibitors of human neutrophil elastase. J Med Chem 44:1268-85 (2001)  
Target
Name:
Neutrophil elastase
Synonyms:
Bone marrow serine protease Coagulation factor X ELANE Elastase HLE Leukocyte elastase Medullasin Neutrophil elastase (HNE) PMN elastase Trypsin
Type:
Enzyme
Mol. Mass.:
28532.38
Organism:
Homo sapiens (Human)
Description:
P08246
Residue:
267
  
Inhibitor
Name:
BDBM50098832
Synonyms:
CHEMBL282947 | N-[1-(5-tert-Butyl-[1,3,4]oxadiazole-2-carbonyl)-2-methyl-propyl]-2-(6-oxo-2-phenyl-6H-pyrimidin-1-yl)-acetamide
Type:
Small organic molecule
Emp. Form.:
C23H27N5O4
Mol. Mass.:
437.4916
SMILES:
CC(C)[C@H](NC(=O)Cn1c(nccc1=O)-c1ccccc1)C(=O)c1nnc(o1)C(C)(C)C
: