Target
D(2) dopamine receptor
Ligand
BDBM50115281
Substrate
Meas. Tech.
ChEMBL_60235 (CHEMBL671417)
Ki
630±n/a nM
Citation
 Dijkstra, DRodenhuis, NVermeulen, ESPugsley, TAWise, LDWikström, HV Further characterization of structural requirements for ligands at the dopamine D(2) and D(3) receptor: exploring the thiophene moiety. J Med Chem 45:3022-31 (2002)  
Target
Name:
D(2) dopamine receptor
Synonyms:
D(2) dopamine receptor DOPAMINE D2 Long DRD2 Dopamine D2 receptor Dopamine D2 receptor (D2R) Dopamine2-like | d2
Type:
Cell-surface receptors
Mol. Mass.:
50647.10
Organism:
Homo sapiens (Human)
Description:
P14416
Residue:
443
  
Inhibitor
Name:
BDBM50115281
Synonyms:
6-Propyl-4,5a,6,7,8,9a-hexahydro-5H-9-oxa-3-thia-6-aza-cyclopenta[a]naphthalene | CHEMBL102632
Type:
Small organic molecule
Emp. Form.:
C13H19NOS
Mol. Mass.:
237.361
SMILES:
CCCN1CCOC2C1CCc1sccc21
: