Target
D(2) dopamine receptor
Ligand
BDBM50115280
Substrate
Meas. Tech.
ChEMBL_60235 (CHEMBL671417)
Ki
3107±n/a nM
Citation
 Dijkstra, DRodenhuis, NVermeulen, ESPugsley, TAWise, LDWikström, HV Further characterization of structural requirements for ligands at the dopamine D(2) and D(3) receptor: exploring the thiophene moiety. J Med Chem 45:3022-31 (2002)  
Target
Name:
D(2) dopamine receptor
Synonyms:
D(2) dopamine receptor DOPAMINE D2 Long DRD2 Dopamine D2 receptor Dopamine D2 receptor (D2R) Dopamine2-like | d2
Type:
Cell-surface receptors
Mol. Mass.:
50647.10
Organism:
Homo sapiens (Human)
Description:
P14416
Residue:
443
  
Inhibitor
Name:
BDBM50115280
Synonyms:
CHEMBL103912 | Dipropyl-(4,5,6,7-tetrahydro-benzo[b]thiophen-6-ylmethyl)-amine
Type:
Small organic molecule
Emp. Form.:
C15H25NS
Mol. Mass.:
251.431
SMILES:
CCCN(CCC)CC1CCc2ccsc2C1
: