Target
D(3) dopamine receptor
Ligand
BDBM50115282
Substrate
Meas. Tech.
ChEMBL_62294 (CHEMBL872893)
Ki
40±n/a nM
Citation
 Dijkstra, DRodenhuis, NVermeulen, ESPugsley, TAWise, LDWikström, HV Further characterization of structural requirements for ligands at the dopamine D(2) and D(3) receptor: exploring the thiophene moiety. J Med Chem 45:3022-31 (2002)  
Target
Name:
D(3) dopamine receptor
Synonyms:
DOPAMINE D3 DRD3_HUMAN Dopamine D3 receptor (D3) Dopamine receptor Dopamine receptor D3
Type:
Mol. Mass.:
44243.43
Organism:
Homo sapiens (Human)
Description:
Residue:
400
  
Inhibitor
Name:
BDBM50115282
Synonyms:
CHEMBL103622 | Dipropyl-(4,5,6,7-tetrahydro-benzo[b]thiophen-5-yl)-amine
Type:
Small organic molecule
Emp. Form.:
C14H23NS
Mol. Mass.:
237.404
SMILES:
CCCN(CCC)C1CCc2sccc2C1
: