Target
D(3) dopamine receptor
Ligand
BDBM50115280
Substrate
Meas. Tech.
ChEMBL_62294 (CHEMBL872893)
Ki
60±n/a nM
Citation
 Dijkstra, DRodenhuis, NVermeulen, ESPugsley, TAWise, LDWikström, HV Further characterization of structural requirements for ligands at the dopamine D(2) and D(3) receptor: exploring the thiophene moiety. J Med Chem 45:3022-31 (2002)  
Target
Name:
D(3) dopamine receptor
Synonyms:
DOPAMINE D3 DRD3_HUMAN Dopamine D3 receptor (D3) Dopamine receptor Dopamine receptor D3
Type:
Mol. Mass.:
44243.43
Organism:
Homo sapiens (Human)
Description:
Residue:
400
  
Inhibitor
Name:
BDBM50115280
Synonyms:
CHEMBL103912 | Dipropyl-(4,5,6,7-tetrahydro-benzo[b]thiophen-6-ylmethyl)-amine
Type:
Small organic molecule
Emp. Form.:
C15H25NS
Mol. Mass.:
251.431
SMILES:
CCCN(CCC)CC1CCc2ccsc2C1
: