Target
Melanocortin receptor 5
Ligand
BDBM50122062
Substrate
Meas. Tech.
ChEMBL_104262 (CHEMBL711699)
EC50
180±n/a nM
Citation
 Holder, JRXiang, ZBauzo, RMHaskell-Luevano, C Structure-activity relationships of the melanocortin tetrapeptide Ac-His-D-Phe-Arg-Trp-NH2 at the mouse melanocortin receptors. 4. Modifications at the Trp position. J Med Chem 45:5736-44 (2002)  
Target
Name:
Melanocortin receptor 5
Synonyms:
MC5R_MOUSE Melanocortin receptor 5 | Melanocortin receptor 5 (MC5R)
Type:
Enzyme
Mol. Mass.:
36966.58
Organism:
Mus musculus (Mouse)
Description:
P41149
Residue:
325
  
Inhibitor
Name:
BDBM50122062
Synonyms:
Ac-His-D-Phe-Arg-Atc-NH2 | CHEMBL153420
Type:
Small organic molecule
Emp. Form.:
C34H44N10O5
Mol. Mass.:
672.7772
SMILES:
CC(=O)N[C@@H](Cc1cnc[nH]1)C(=O)N[C@@H](Cc1ccccc1)C(=O)N[C@@H](CCCNC(N)=N)C(=O)NC1(CCc2ccccc2C1)C(N)=O
: