Target
Alpha-1D adrenergic receptor
Ligand
BDBM50030614
Substrate
Meas. Tech.
ChEMBL_32436 (CHEMBL646097)
Ki
1.6±n/a nM
Citation
 Romeo, GMateria, LManetti, FCagnotto, AMennini, TNicoletti, FBotta, MRusso, FMinneman, KP New pyrimido[5,4-b]indoles as ligands for alpha(1)-adrenoceptor subtypes. J Med Chem 46:2877-94 (2003)  
Target
Name:
Alpha-1D adrenergic receptor
Synonyms:
ADA1D_HUMAN ADRA1D Adrenergic receptor alpha Alpha 1D-adrenoreceptor Alpha-1D adrenoceptor adrenergic Alpha1D
Type:
Enzyme Catalytic Domain
Mol. Mass.:
60485.82
Organism:
Homo sapiens (Human)
Description:
adrenergic Alpha1D ADRA1D HUMAN::P25100
Residue:
572
  
Inhibitor
Name:
BDBM50030614
Synonyms:
5-Chloro-8-methyl-1-vinyl-6,7,8,9-tetrahydro-2-thia-8-aza-benzo[cd]azulene SK&F-104856 SKF 104856
Type:
Small organic molecule
Emp. Form.:
C14H14ClNS
Mol. Mass.:
263.786
SMILES:
CN1CCc2c(Cl)ccc3sc(C=C)c(C1)c23
: