Target
Beta-lactamase TEM
Ligand
BDBM50111589
Substrate
Meas. Tech.
ChEMBL_40382 (CHEMBL649989)
IC50
7000±n/a nM
Citation
 McGovern, SLHelfand, BTFeng, BShoichet, BK A specific mechanism of nonspecific inhibition. J Med Chem 46:4265-72 (2003)  
Target
Name:
Beta-lactamase TEM
Synonyms:
BLAT_ECOLX Beta-lactamase (TEM-1) Beta-lactamase TEM-1 Beta-lactamase TEM1D Beta-lactamase TEM1F TEM extended-spectrum beta-lactamase bla
Type:
Enzyme
Mol. Mass.:
31512.33
Organism:
Escherichia coli
Description:
P62593
Residue:
286
  
Inhibitor
Name:
BDBM50111589
Synonyms:
2-[(3,5-diiodo-4-oxidophenyl)(3,5-diiodo-4-oxocyclohexa-2,5-dien-1-ylidene)methyl]benzoate | 2-[3,5-diiodo-4-olatophenyl(3,5-diiodo-4-oxo-2,5-cyclohexadienyliden)methyl]benzoate
Type:
Small organic molecule
Emp. Form.:
C20H8I4O4
Mol. Mass.:
819.8941
SMILES:
[#8-]-[#6](=O)-c1ccccc1\[#6](=[#6]-1\[#6]=[#6](I)-[#6](=O)-[#6](I)=[#6]-1)-c1cc(I)c(-[#8-])c(I)c1
: