Target
Transporter
Ligand
BDBM50005536
Substrate
Meas. Tech.
ChEMBL_144984 (CHEMBL754326)
Ki
0.8±n/a nM
Citation
 Orjales, AMosquera, RToledo, APumar, MCGarcía, NCortizo, LLabeaga, LInnerárity, A Syntheses and binding studies of new [(aryl)(aryloxy)methyl]piperidine derivatives and related compounds as potential antidepressant drugs with high affinity for serotonin (5-HT) and norepinephrine (NE) transporters. J Med Chem 46:5512-32 (2003)  
Target
Name:
Transporter
Synonyms:
Monoamine transporters; Norepininephrine & dopamine | Norepinephrine Monoamine transporters
Type:
PROTEIN
Mol. Mass.:
66787.87
Organism:
Rattus norvegicus
Description:
ChEMBL_1463061
Residue:
597
  
Inhibitor
Name:
BDBM50005536
Synonyms:
42-548 5-(4-chlorophenyl)-3,5-dihydro-2H-imidazo[2,1-a]isoindol-5-ol CHEMBL781 Mazanor mazindole
Type:
Small organic molecule
Emp. Form.:
C16H13ClN2O
Mol. Mass.:
284.74
SMILES:
OC1(N2CCN=C2c2ccccc12)c1ccc(Cl)cc1
: