Target
5-hydroxytryptamine receptor 4
Ligand
BDBM82519
Substrate
Meas. Tech.
ChEMBL_3275 (CHEMBL619076)
Ki
48±n/a nM
Citation
 Hirokawa, YFujiwara, ISuzuki, KHarada, HYoshikawa, TYoshida, NKato, S Synthesis and structure-affinity relationships of novel N-(1-ethyl-4-methylhexahydro-1,4-diazepin-6-yl)pyridine-3-carboxamides with potent serotonin 5-HT3 and dopamine D2 receptor antagonistic activity. J Med Chem 46:702-15 (2003)  
Target
Name:
5-hydroxytryptamine receptor 4
Synonyms:
5-HT4 5HT4R_CAVPO Serotonin 4 (5-HT4) receptor
Type:
Enzyme Catalytic Domain
Mol. Mass.:
43735.29
Organism:
GUINEA PIG
Description:
5-HT4 HTR4 GUINEA PIG::O70528
Residue:
388
  
Inhibitor
Name:
BDBM82519
Synonyms:
4-amino-5-chloro-2-methoxy-N-(8-methyl-8-azabicyclo[3.2.1]octan-3-yl)benzamide CAS_76272-78-1
Type:
Small organic molecule
Emp. Form.:
C16H22ClN3O2
Mol. Mass.:
323.818
SMILES:
[H]C12CCC([H])(CC(C1)NC(=O)c1cc(Cl)c(N)cc1OC)N2C
: