Target
D(2) dopamine receptor
Ligand
BDBM50123801
Substrate
Meas. Tech.
ChEMBL_62085 (CHEMBL672457)
Ki
24.3±n/a nM
Citation
 Hirokawa, YFujiwara, ISuzuki, KHarada, HYoshikawa, TYoshida, NKato, S Synthesis and structure-affinity relationships of novel N-(1-ethyl-4-methylhexahydro-1,4-diazepin-6-yl)pyridine-3-carboxamides with potent serotonin 5-HT3 and dopamine D2 receptor antagonistic activity. J Med Chem 46:702-15 (2003)  
Target
Name:
D(2) dopamine receptor
Synonyms:
DOPAMINE D2 DOPAMINE D2 Short Dopamine D2 receptor Drd2
Type:
G Protein-Coupled Receptor (GPCR)
Mol. Mass.:
50931.60
Organism:
Rattus norvegicus (rat)
Description:
P61169
Residue:
444
  
Inhibitor
Name:
BDBM50123801
Synonyms:
4-Amino-N-[2-(benzyl-methyl-amino)-ethyl]-5-chloro-2-methoxy-benzamide | CHEMBL20748
Type:
Small organic molecule
Emp. Form.:
C18H22ClN3O2
Mol. Mass.:
347.839
SMILES:
COc1cc(N)c(Cl)cc1C(=O)NCCN(C)Cc1ccccc1
: