Target
D(3) dopamine receptor
Ligand
BDBM50070566
Substrate
Meas. Tech.
ChEMBL_62617 (CHEMBL678240)
IC50
14.3±n/a nM
Citation
 Hirokawa, YFujiwara, ISuzuki, KHarada, HYoshikawa, TYoshida, NKato, S Synthesis and structure-affinity relationships of novel N-(1-ethyl-4-methylhexahydro-1,4-diazepin-6-yl)pyridine-3-carboxamides with potent serotonin 5-HT3 and dopamine D2 receptor antagonistic activity. J Med Chem 46:702-15 (2003)  
Target
Name:
D(3) dopamine receptor
Synonyms:
DOPAMINE D3 Dopamine D3 receptor | Drd3
Type:
Protein
Mol. Mass.:
49540.58
Organism:
Rattus norvegicus (Rat)
Description:
P19020
Residue:
446
  
Inhibitor
Name:
BDBM50070566
Synonyms:
5-Bromo-N-((S)-1-ethyl-4-methyl-[1,4]diazepan-6-yl)-2-methoxy-6-methylamino-nicotinamide | CHEMBL40497
Type:
Small organic molecule
Emp. Form.:
C16H26BrN5O2
Mol. Mass.:
400.314
SMILES:
CCN1CCN(C)C[C@@H](C1)NC(=O)c1cc(Br)c(NC)nc1OC
: