Target
5-hydroxytryptamine receptor 4
Ligand
BDBM50241107
Substrate
Meas. Tech.
ChEMBL_3263 (CHEMBL617872)
IC50
>1000±n/a nM
Citation
 Hirokawa, YFujiwara, ISuzuki, KHarada, HYoshikawa, TYoshida, NKato, S Synthesis and structure-affinity relationships of novel N-(1-ethyl-4-methylhexahydro-1,4-diazepin-6-yl)pyridine-3-carboxamides with potent serotonin 5-HT3 and dopamine D2 receptor antagonistic activity. J Med Chem 46:702-15 (2003)  
Target
Name:
5-hydroxytryptamine receptor 4
Synonyms:
5-HT4 5HT4R_CAVPO Serotonin 4 (5-HT4) receptor
Type:
Enzyme Catalytic Domain
Mol. Mass.:
43735.29
Organism:
GUINEA PIG
Description:
5-HT4 HTR4 GUINEA PIG::O70528
Residue:
388
  
Inhibitor
Name:
BDBM50241107
Synonyms:
1-(3-(4-(5-chloro-2-oxo-2,3-dihydrobenzo[d]imidazol-1-yl)piperidin-1-yl)propyl)-1H-benzo[d]imidazol-2(3H)-one 5-Chloro-1-{1-[3-(2-oxo-2,3-dihydro-benzoimidazol-1-yl)-propyl]-piperidin-4-yl}-1,3-dihydro-benzoimidazol-2-one(domperidone) 5-chloro-1-{1-[3-(2-oxo-2,3-dihydro-benzoimidazol-1-yl)-propyl]-piperidin-4-yl}-1,3-dihydro-benzoimidazol-2-one CHEMBL219916 DOMPERIDONE5-Chloro-1-{1-[3-(2-oxo-2,3-dihydro-benzoimidazol-1-yl)-propyl]-piperidin-4-yl}-1,3-dihydro-benzoimidazol-2-one US9132134, Domperidone
Type:
Small organic molecule
Emp. Form.:
C22H24ClN5O2
Mol. Mass.:
425.911
SMILES:
Clc1ccc2n(C3CCN(CCCn4c5ccccc5[nH]c4=O)CC3)c(=O)[nH]c2c1
: