Target
5-hydroxytryptamine receptor 4
Ligand
BDBM94630
Substrate
Meas. Tech.
ChEMBL_3275 (CHEMBL619076)
Ki
69.9±n/a nM
Citation
 Hirokawa, YFujiwara, ISuzuki, KHarada, HYoshikawa, TYoshida, NKato, S Synthesis and structure-affinity relationships of novel N-(1-ethyl-4-methylhexahydro-1,4-diazepin-6-yl)pyridine-3-carboxamides with potent serotonin 5-HT3 and dopamine D2 receptor antagonistic activity. J Med Chem 46:702-15 (2003)  
Target
Name:
5-hydroxytryptamine receptor 4
Synonyms:
5-HT4 5HT4R_CAVPO Serotonin 4 (5-HT4) receptor
Type:
Enzyme Catalytic Domain
Mol. Mass.:
43735.29
Organism:
GUINEA PIG
Description:
5-HT4 HTR4 GUINEA PIG::O70528
Residue:
388
  
Inhibitor
Name:
BDBM94630
Synonyms:
4-Amino-5-chloro-2-ethoxy-N-[4-(4-fluoro-benzyl)-morpholin-2-ylmethyl]-benzamide; citrate(AS-4370) 4-amino-5-chloro-2-ethoxy-N-[[4-[(4-fluorophenyl)methyl]-2-morpholinyl]methyl]benzamide;2-hydroxypropane-1,2,3-tricarboxylic acid 4-azanyl-5-chloranyl-2-ethoxy-N-[[4-[(4-fluorophenyl)methyl]morpholin-2-yl]methyl]benzamide;2-oxidanylpropane-1,2,3-tricarboxylic acid MLS001401439 Mosapride cid_119583
Type:
Small organic molecule
Emp. Form.:
C21H25ClFN3O3
Mol. Mass.:
421.893
SMILES:
CCOc1cc(N)c(Cl)cc1C(=O)NCC1CN(Cc2ccc(F)cc2)CCO1
: