Target
Type-2 angiotensin II receptor
Ligand
BDBM50369331
Substrate
Meas. Tech.
ChEMBL_35277 (CHEMBL647776)
Ki
61±n/a nM
Citation
 Rosenström, USköld, CLindeberg, GBotros, MNyberg, FKarlén, AHallberg, A A selective AT2 receptor ligand with a gamma-turn-like mimetic replacing the amino acid residues 4-5 of angiotensin II. J Med Chem 47:859-70 (2004)  
Target
Name:
Type-2 angiotensin II receptor
Synonyms:
AGTR2 AT2 Angiotensin II type 2 (AT-2) receptor Type-2 angiotensin II receptor
Type:
Enzyme Catalytic Domain
Mol. Mass.:
41201.61
Organism:
Homo sapiens (Human)
Description:
Angiotensin II, central 0 0::P50052
Residue:
363
  
Inhibitor
Name:
BDBM50369331
Synonyms:
CHEMBL1791259
Type:
Small organic molecule
Emp. Form.:
C52H66N12O11
Mol. Mass.:
1035.1542
SMILES:
CC[C@@H](C)[C@H](N1Cc2cc(NC(=O)[C@H](CCCN=C(N)N)NC(=O)[C@@H](N)CC(O)=O)ccc2[C@@H](Cc2ccc(O)cc2)C1=O)C(=O)N[C@@H](Cc1cnc[nH]1)C(=O)N1CCC[C@H]1C(=O)N[C@@H](Cc1ccccc1)C(O)=O
: