Target
Endolysin [L99A]
Ligand
BDBM50167941
Substrate
Meas. Tech.
ChEMBL_302213 (CHEMBL826986)
Kd
193000±n/a nM
Citation
 Graves, APBrenk, RShoichet, BK Decoys for docking. J Med Chem 48:3714-28 (2005)  
Target
Name:
Endolysin [L99A]
Synonyms:
E Lysozyme(L99A)
Type:
Mol. Mass.:
18657.83
Organism:
Enterobacteria phage T4
Description:
P00720(L99A)
Residue:
164
  
Inhibitor
Name:
BDBM50167941
Synonyms:
1H-indene | CHEMBL192812
Type:
Small organic molecule
Emp. Form.:
C9H8
Mol. Mass.:
116.1598
SMILES:
C1C=Cc2ccccc12
: