Target
Kappa-type opioid receptor
Ligand
BDBM50370595
Substrate
Meas. Tech.
ChEMBL_303242 (CHEMBL827207)
Ki
2658±n/a nM
Citation
 Spetea, MGreiner, EAceto, MDHarris, LSCoop, ASchmidhammer, H Effect of a 6-cyano substituent in 14-oxygenated N-methylmorphinans on opioid receptor binding and antinociceptive potency. J Med Chem 48:5052-5 (2005)  
Target
Name:
Kappa-type opioid receptor
Synonyms:
KOR-1 OPIATE Kappa Opioid receptor Ror-d
Type:
G Protein-Coupled Receptor (GPCR)
Mol. Mass.:
42692.90
Organism:
Rattus norvegicus (rat)
Description:
P34975
Residue:
380
  
Inhibitor
Name:
BDBM50370595
Synonyms:
OXYCODONE US1184575, oxycodone | US9233167, Oxycodone
Type:
Small organic molecule
Emp. Form.:
C18H21NO4
Mol. Mass.:
315.3636
SMILES:
COc1ccc2C[C@H]3N(C)CC[C@@]45[C@@H](Oc1c24)C(=O)CC[C@@]35O
: