Target
Reverse transcriptase/RNaseH
Ligand
BDBM50164638
Substrate
Meas. Tech.
ChEMBL_302539 (CHEMBL875215)
Ki
46±n/a nM
Citation
 Boyle, NARajwanshi, VKPrhavc, MWang, GFagan, PChen, FEwing, GJBrooks, JLHurd, TLeeds, JMBruice, TWCook, PD Synthesis of 2',3'-dideoxynucleoside 5'-alpha-P-borano-beta,gamma-(difluoromethylene)triphosphates and their inhibition of HIV-1 reverse transcriptase. J Med Chem 48:2695-700 (2005)  
Target
Name:
Reverse transcriptase/RNaseH
Synonyms:
HIV-1 Reverse Transcriptase RNase H Reverse transcriptase/RNaseH
Type:
PROTEIN
Mol. Mass.:
65229.15
Organism:
Human immunodeficiency virus 1
Description:
ChEMBL_1473730
Residue:
566
  
Inhibitor
Name:
BDBM50164638
Synonyms:
2',3'-Dideoxynucleoside5'-alpha-P-Borano-beta,gamma-(difluoromethylene)triphosphates derivative | CHEMBL191316
Type:
Small organic molecule
Emp. Form.:
C11H15BF3N2O11P3
Mol. Mass.:
511.973
SMILES:
[BH3-]P(=O)(OCC1OC(CC1F)n1cc(C)c(=O)[nH]c1=O)OP([O-])(=O)C(F)(F)P([O-])([O-])=O
: