Target
Heat shock protein HSP 90-alpha
Ligand
BDBM50173903
Substrate
Meas. Tech.
ChEMBL_320742 (CHEMBL881215)
Kd
>100000±n/a nM
Citation
 Rastelli, GTian, ZQWang, ZMyles, DLiu, Y Structure-based design of 7-carbamate analogs of geldanamycin. Bioorg Med Chem Lett 15:5016-21 (2005)  
Target
Name:
Heat shock protein HSP 90-alpha
Synonyms:
HS90A_HUMAN HSP86 HSP90AA1 HSPCA Heat shock 86 kDa Heat shock protein HSP 90-alpha (HSP90) LAP-2 Lipopolysaccharide-associated protein 2 heat shock protein 90kDa alpha (cytosolic), class A member 1 isoform 2
Type:
Molecular Chaperone
Mol. Mass.:
84623.45
Organism:
Homo sapiens (Human)
Description:
P07900
Residue:
732
  
Inhibitor
Name:
BDBM50173903
Synonyms:
CHEMBL197795 | Methyl-carbamic acid (4E,6Z)-(13S,14S,17R,19S)-19-(2-dimethylamino-ethylamino)-13-(S)-hydroxy-8,14-dimethoxy-4,12,16-trimethyl-10-(R)-methyl-3,20,22-trioxo-2-aza-bicyclo[16.3.1]docosa-1(21),4,6,10,18-pentaen-9-yl ester
Type:
Small organic molecule
Emp. Form.:
C33H50N4O8
Mol. Mass.:
630.7721
SMILES:
CNC(=O)O[C@@H]1[C@@H](OC)C=CC=C(C)C(=O)Nc2cc(O)c(N=CCN(C)C)c(C[C@@H](C)C[C@H](OC)[C@H](O)[C@@H](C)\C=C1/C)c2O
: