Target
Type-2 angiotensin II receptor
Ligand
BDBM50370685
Substrate
Meas. Tech.
ChEMBL_321033 (CHEMBL883665)
pH
7.4±n/a
Ki
463.7±n/a nM
Comments
extracted
Citation
 Georgsson, JSköld, CPlouffe, BLindeberg, GBotros, MLarhed, MNyberg, FGallo-Payet, NGogoll, AKarlén, AHallberg, A Angiotensin II pseudopeptides containing 1,3,5-trisubstituted benzene scaffolds with high AT2 receptor affinity. J Med Chem 48:6620-31 (2005)  
Target
Name:
Type-2 angiotensin II receptor
Synonyms:
AGTR2 AT2 Angiotensin II type 2 (AT-2) receptor Type-2 angiotensin II receptor
Type:
Enzyme Catalytic Domain
Mol. Mass.:
41201.61
Organism:
Homo sapiens (Human)
Description:
Angiotensin II, central 0 0::P50052
Residue:
363
  
Inhibitor
Name:
BDBM50370685
Synonyms:
CHEMBL1791351
Type:
Small organic molecule
Emp. Form.:
C51H66N12O11
Mol. Mass.:
1023.1435
SMILES:
CC[C@@H](C)[C@H](NC(=O)c1cc(CNC(=O)[C@H](CCCN=C(N)N)NC(=O)[C@@H](N)CC(O)=O)cc(Cc2ccc(O)cc2)c1)C(=O)N[C@@H](Cc1cnc[nH]1)C(=O)N1CCC[C@H]1C(=O)N[C@@H](Cc1ccccc1)C(O)=O
: