Target
D(2) dopamine receptor
Ligand
BDBM50174009
Substrate
Meas. Tech.
ChEMBL_326849 (CHEMBL860444)
Ki
38000±n/a nM
Citation
 Arora, JBordeleau, MDube, LJarvie, KMazzocco, LPeragine, JTehim, AEgle, I N-[(3S)-1-benzylpyrrolidin-3-yl]-(2-thienyl)benzamides: human dopamine D4 ligands with high affinity for the 5-HT2A receptor. Bioorg Med Chem Lett 15:5253-6 (2005)  
Target
Name:
D(2) dopamine receptor
Synonyms:
D(2) dopamine receptor DOPAMINE D2 Long DRD2 Dopamine D2 receptor Dopamine D2 receptor (D2R) Dopamine2-like | d2
Type:
Cell-surface receptors
Mol. Mass.:
50647.10
Organism:
Homo sapiens (Human)
Description:
P14416
Residue:
443
  
Inhibitor
Name:
BDBM50174009
Synonyms:
(S)-N-(1-(2-fluorobenzyl)pyrrolidin-3-yl)-4-(thiophen-2-yl)benzamide | CHEMBL196866
Type:
Small organic molecule
Emp. Form.:
C22H21FN2OS
Mol. Mass.:
380.478
SMILES:
Fc1ccccc1CN1CC[C@@H](C1)NC(=O)c1ccc(cc1)-c1cccs1
: