Target
5-hydroxytryptamine receptor 2A
Ligand
BDBM50152314
Substrate
Meas. Tech.
ChEMBL_326847 (CHEMBL860442)
Ki
1.8±n/a nM
Citation
 Arora, JBordeleau, MDube, LJarvie, KMazzocco, LPeragine, JTehim, AEgle, I N-[(3S)-1-benzylpyrrolidin-3-yl]-(2-thienyl)benzamides: human dopamine D4 ligands with high affinity for the 5-HT2A receptor. Bioorg Med Chem Lett 15:5253-6 (2005)  
Target
Name:
5-hydroxytryptamine receptor 2A
Synonyms:
5-HT-2 5-HT2A 5-hydroxytryptamine receptor 2A (5HT-2A) 5HT2A_HUMAN HTR2A | Serotonin receptor 2A
Type:
undefined
Mol. Mass.:
52607.65
Organism:
Homo sapiens (Human)
Description:
P28223
Residue:
471
  
Inhibitor
Name:
BDBM50152314
Synonyms:
(S)-N-(1-benzylpyrrolidin-3-yl)-4-(thiophen-2-yl)benzamide N-((S)-1-Benzyl-pyrrolidin-3-yl)-4-thiophen-2-yl-benzamide
Type:
Small organic molecule
Emp. Form.:
C22H22N2OS
Mol. Mass.:
362.488
SMILES:
O=C(N[C@H]1CCN(Cc2ccccc2)C1)c1ccc(cc1)-c1cccs1
: