Target
Cannabinoid receptor 1
Ligand
BDBM50067499
Substrate
Meas. Tech.
ChEMBL_330574 (CHEMBL871152)
Ki
2.75±n/a nM
Citation
 Muccioli, GGWouters, JCharlier, CScriba, GKPizza, TDi Pace, PDe Martino, PPoppitz, WPoupaert, JHLambert, DM Synthesis and activity of 1,3,5-triphenylimidazolidine-2,4-diones and 1,3,5-triphenyl-2-thioxoimidazolidin-4-ones: characterization of new CB1 cannabinoid receptor inverse agonists/antagonists. J Med Chem 49:872-82 (2006)  
Target
Name:
Cannabinoid receptor 1
Synonyms:
Brain-type cannabinoid receptor CB-R CNR1_RAT Cannabinoid receptor Cnr1 | Skr6
Type:
G Protein-Coupled Receptor (GPCR)
Mol. Mass.:
52856.55
Organism:
Rattus norvegicus (rat)
Description:
P20272
Residue:
473
  
Inhibitor
Name:
BDBM50067499
Synonyms:
(6aR,10aR)-3(1,1-dimethylheptyl)-9-hydroxymethyl)-6,6-dimethyl-6a,7,10,10a-tetrahydro-6H-benzo[c]chromen-1-ol (6aR,10aR)-9-(hydroxymethyl)-6,6-dimethyl-3-(2-methyloctan-2-yl)-6a,7,10,10a-tetrahydro-6H-benzo[c]chromen-1-ol HU-210 | US9365534, HU-210
Type:
Small organic molecule
Emp. Form.:
C25H38O3
Mol. Mass.:
386.5674
SMILES:
CCCCCCC(C)(C)c1cc(O)c2[C@@H]3CC(CO)=CC[C@H]3C(C)(C)Oc2c1
: