Target
Delta-type opioid receptor
Ligand
BDBM21146
Substrate
Meas. Tech.
ChEMBL_335170 (CHEMBL861292)
IC50
29±n/a nM
Citation
 Lee, YSAgnes, RSBadghisi, HDavis, PMa, SWLai, JPorreca, FHruby, VJ Design and synthesis of novel hydrazide-linked bifunctional peptides as delta/mu opioid receptor agonists and CCK-1/CCK-2 receptor antagonists. J Med Chem 49:1773-80 (2006)  
Target
Name:
Delta-type opioid receptor
Synonyms:
DOR-1 MSL-2 OPRD_MOUSE Oprd1
Type:
Enzyme Catalytic Domain
Mol. Mass.:
40577.25
Organism:
MOUSE
Description:
P32300
Residue:
372
  
Inhibitor
Name:
BDBM21146
Synonyms:
(3S)-3-[(2S)-2-[(2S)-2-{2-[(2R)-2-[(2S)-2-[(3S)-3-amino-3-formamidopropanoic acid]-3-(4-hydroxyphenyl)propanamido]-3-phenylpropanamido]acetamido}-3-(1H-indol-3-yl)-N-methylpropanamido]hexanamido]-3-{[(1S)-1-carbamoyl-2-phenylethyl]carbamoyl}propanoic acid CHEMBL407057 | SNF-9007
Type:
Peptide
Emp. Form.:
C55H66N10O13
Mol. Mass.:
1075.1717
SMILES:
CCCC[C@H](N(C)C(=O)[C@H](Cc1c[nH]c2ccccc12)NC(=O)CNC(=O)[C@@H](Cc1ccccc1)NC(=O)[C@H](Cc1ccc(O)cc1)NC(=O)[C@@H](N)CC(O)=O)C(=O)N[C@@H](CC(O)=O)C(=O)N[C@@H](Cc1ccccc1)C(N)=O
: