Target
Melanin-concentrating hormone receptor 1
Ligand
BDBM50190919
Substrate
Meas. Tech.
ChEMBL_402832 (CHEMBL908629)
Ki
0.9±n/a nM
Citation
 Hudson, SKiankarimi, MRowbottom, MWVickers, TDWu, DPontillo, JChing, BDwight, WGoodfellow, VSSchwarz, DHeise, CEMadan, AWen, JBan, WWang, HWade, WS Synthesis and structure-activity relationships of retro bis-aminopyrrolidine urea (rAPU) derived small-molecule antagonists of the melanin-concentrating hormone receptor-1 (MCH-R1). Part 2. Bioorg Med Chem Lett 16:4922-30 (2006)  
Target
Name:
Melanin-concentrating hormone receptor 1
Synonyms:
G-protein coupled receptor 24 MCH receptor 1 MCH-R1 MCHR-1 MCHR1_HUMAN Melanin-Concentrating Hormone Receptor 1 (MCH1R) Melanin-concentrating hormone receptor 1 (MCH-1) Melanin-concentrating hormone receptor 1 (MCHR-1) SLC-1 Somatostatin receptor-like protein
Type:
G Protein-Coupled Receptor (GPCR)
Mol. Mass.:
45976.27
Organism:
Homo sapiens (Human)
Description:
Membranes from CHO-K1 cells stably expressing human MCH1R were used in assays.
Residue:
422
  
Inhibitor
Name:
BDBM50190919
Synonyms:
CHEMBL386454 | N-((S)-1-((R)-3-(4,4-dimethylcyclohexylamino)pyrrolidine-1-carbonyl)pyrrolidin-3-yl)-5-(4-methoxyphenyl)-N-methylthiophene-2-carboxamide
Type:
Small organic molecule
Emp. Form.:
C30H42N4O3S
Mol. Mass.:
538.744
SMILES:
COc1ccc(cc1)-c1ccc(s1)C(=O)N(C)[C@H]1CCN(C1)C(=O)N1CC[C@H](C1)NC1CCC(C)(C)CC1
: